Reaction Details
TargetAlpha-1A/Alpha-2A adrenergic receptor
LigandBDBM50224790
Substrate/Competitorn/a
Meas. Tech.ChEMBL_30242 (CHEMBL644381)
IC50 34.0±n/a nM
Citation Anderson, PSBaldwin, JJMcClure, DELundell, GFJones, JHRandall, WCMartin, GEWilliams, MHirshfield, JMClineschmidt, BVLumma, PKRemy, DC Synthesis of (7R)-7H-indolo[3,4-gh][1,4]benzoxazines, a new class of D-heteroergolines with dopamine agonist activity. J Med Chem26:363-7 (1983) Alpha-1A/Alpha-2A adrenergic receptor
Name:Alpha-1A/Alpha-2A adrenergic receptor
Synonyms:Cerebral cortex alpha adrenergic receptor
Type:n/a
Mol. Mass.:n/a
Description:ASSAY_ID of ChEMBL is 30242
Components:This complex has 2 components.
Component 1
Name:Alpha-1A adrenergic receptor
Type:Enzyme Catalytic Domain
Mol. Mass.:51492.08
Organism:CALF
Description:adrenergic Alpha1 0 CALF
Residue:466
Component 2
Name:Alpha-2A adrenergic receptor
Synonyms:ADA2A_BOVIN Alpha-2A adrenergic receptor Alpha-2A adrenoreceptor Alpha-2D adrenergic receptor Cerebral cortex alpha adrenergic receptor adrenergic Alpha2D
Type:Enzyme Catalytic Domain
Mol. Mass.:49275.13
Organism:BOVINE
Description:adrenergic Alpha2 0 BOVINE::Q28838
Residue:452
BDBM50224790
NameBDBM50224790
Synonyms:CHEMBL333794
TypeSmall organic molecule
Emp. Form.C15H18N2O
Mol. Mass.242.3162
SMILES[H][C@@]12Cc3c[nH]c4cccc(c34)[C@@]1([H])OCCN2CC