Reaction Details
TargetAlpha-1A/Alpha-1B/Alpha-1D adrenergic receptor
LigandBDBM50033113
Substrate/Competitorn/a
Meas. Tech.ChEMBL_33691 (CHEMBL647162)
Ki 25±n/a nM
Citation Clark, RDCaroon, JMRepke, DBStrosberg, AMBitter, SMOkada, MDMichel, ADWhiting, RL Antihypertensive 9-substituted 1-oxa-4,9-diazaspiro[5.5]undecan-3-ones. J Med Chem26:855-61 (1983) Alpha-1A/Alpha-1B/Alpha-1D adrenergic receptor
Name:Alpha-1A/Alpha-1B/Alpha-1D adrenergic receptor
Type:n/a
Mol. Mass.:n/a
Description:ASSAY_ID of EBI is 303470
Components:This complex has 3 components.
Component 1
Name:Alpha-1B adrenergic receptor
Synonyms:ADA1B_RAT Alpha 1B-adrenoceptor Alpha adrenergic receptor 1A and 1B Alpha-1Adrenoceptor Alpha-1B adrenoreceptor | adrenergic Alpha1B
Type:G Protein-Coupled Receptor (GPCR)
Mol. Mass.:56606.71
Organism:Rattus norvegicus (rat)
Description:Receptor binding assays were performed using rat cortical membranes.
Residue:515
Component 2
Name:Alpha-1A adrenergic receptor
Synonyms:ADA1A_RAT Adra1c Alpha-1A adrenoceptor Alpha-1C adrenergic receptor | adrenergic Alpha1A
Type:Protein
Mol. Mass.:51620.15
Organism:Rattus norvegicus (Rat)
Description:P43140
Residue:466
Component 3
Name:Alpha-1D adrenergic receptor
Synonyms:ADA1D_RAT Adra1d Alpha-1D adrenergic receptor | Serotonin 1a (5-HT1a) receptor/Adrenergic receptor alpha-1
Type:Protein
Mol. Mass.:59375.97
Organism:Rattus norvegicus (Rat)
Description:P23944
Residue:561
BDBM50033113
NameBDBM50033113
Synonyms:CHEMBL279516 INDORAMINE N-{1-[2-(1H-Indol-3-yl)-ethyl]-piperidin-4-yl}-benzamide N-{1-[2-(1H-Indol-3-yl)-ethyl]-piperidin-4-yl}-benzamide(indoramin)
TypeSmall organic molecule
Emp. Form.C22H25N3O
Mol. Mass.347.4534
SMILESO=C(NC1CCN(CCc2c[nH]c3ccccc23)CC1)c1ccccc1