Reaction Details
TargetDihydrofolate reductase
LigandBDBM50405062
Substrate/Competitorn/a
Meas. Tech.ChEMBL_54084 (CHEMBL669981)
Ki 2951±n/a nM
Citation Hathaway, BAGuo, ZRHansch, CDelcamp, TJSusten, SSFreisheim, JH Inhibition of human dihydrofolate reductase by 4,6-diamino-1,2-dihydro-2,2-dimethyl-1-(substituted-phenyl)-s-triazine s. A quantitative structure-activity relationship analysis. J Med Chem27:144-9 (1984) Dihydrofolate reductase
Name:Dihydrofolate reductase
Type:Enzyme
Mol. Mass.:21453.99
Organism:Homo sapiens (Human)
Description:Recombinant human DHFR.
Residue:187
BDBM50405062
NameBDBM50405062
Synonyms:CHEMBL33677
TypeSmall organic molecule
Emp. Form.C17H27N5O
Mol. Mass.317.4292
SMILESCCCCCCOc1ccc(cc1)N1C(N)=NC(N)=NC1(C)C