Reaction Details
TargetDihydrofolate reductase
LigandBDBM50405077
Substrate/Competitorn/a
Meas. Tech.ChEMBL_54084 (CHEMBL669981)
Ki 22387±n/a nM
Citation Hathaway, BAGuo, ZRHansch, CDelcamp, TJSusten, SSFreisheim, JH Inhibition of human dihydrofolate reductase by 4,6-diamino-1,2-dihydro-2,2-dimethyl-1-(substituted-phenyl)-s-triazine s. A quantitative structure-activity relationship analysis. J Med Chem27:144-9 (1984) Dihydrofolate reductase
Name:Dihydrofolate reductase
Type:Enzyme
Mol. Mass.:21453.99
Organism:Homo sapiens (Human)
Description:Recombinant human DHFR.
Residue:187
BDBM50405077
NameBDBM50405077
Synonyms:CHEMBL33499
TypeSmall organic molecule
Emp. Form.C11H16N6
Mol. Mass.232.2849
SMILESCC1(C)N=C(N)N=C(N)N1c1ccc(N)cc1