Reaction Details
TargetDihydrofolate reductase
LigandBDBM50090075
Substrate/Competitorn/a
Meas. Tech.ChEMBL_54084 (CHEMBL669981)
Ki 1738±n/a nM
Citation Hathaway, BAGuo, ZRHansch, CDelcamp, TJSusten, SSFreisheim, JH Inhibition of human dihydrofolate reductase by 4,6-diamino-1,2-dihydro-2,2-dimethyl-1-(substituted-phenyl)-s-triazine s. A quantitative structure-activity relationship analysis. J Med Chem27:144-9 (1984) Dihydrofolate reductase
Name:Dihydrofolate reductase
Type:Enzyme
Mol. Mass.:21453.99
Organism:Homo sapiens (Human)
Description:Recombinant human DHFR.
Residue:187
BDBM50090075
NameBDBM50090075
Synonyms:1-(4-Bromo-phenyl)-6,6-dimethyl-1,6-dihydro-[1,3,5]triazine-2,4-diamine | CHEMBL6741
TypeSmall organic molecule
Emp. Form.C11H14BrN5
Mol. Mass.296.166
SMILESCC1(C)N=C(N)N=C(N)N1c1ccc(Br)cc1