Reaction Details
TargetEstrogen receptor beta
LigandBDBM50225310
Substrate/Competitorn/a
Meas. Tech.ChEMBL_66552 (CHEMBL677819)
Kd 160±n/a nM
Citation Pillai, KMMurray, WVShooshani, IWilliams, DLGordon, DWang, SYJohnson, F Steroids. 2. Synthesis of C-18 functionalized steroids via the Smith-Hughes route. J Med Chem27:1131-7 (1984) Estrogen receptor beta
Name:Estrogen receptor beta
Synonyms:Estrogen receptor
Type:n/a
Mol. Mass.:n/a
Description:ASSAY_ID of ChEMBL is 66549
Components:This complex has 2 components.
Component 1
Name:Estrogen receptor
Type:Enzyme Catalytic Domain
Mol. Mass.:67045.89
Organism:RAT
Description:estrogen alpha 0 RAT::P06211
Residue:600
Component 2
Name:Estrogen receptor beta
Synonyms:ESR2_RAT Esr2 Estrogen receptor beta | Nr3a2
Type:PROTEIN
Mol. Mass.:59173.80
Organism:Rattus norvegicus
Description:ChEMBL_803011
Residue:530
BDBM50225310
NameBDBM50225310
Synonyms:CHEMBL1794824
TypeSmall organic molecule
Emp. Form.C40H52O4
Mol. Mass.596.8385
SMILES[H][C@](O)(C#C)C12CCCC1C1CCC3=CC(=O)CC[C@]3([H])C1CC2.[H][C@@](O)(C#C)C12CCCC1C1CCC3=CC(=O)CC[C@]3([H])C1CC2