Reaction Details
TargetEstrogen receptor beta
LigandBDBM50225311
Substrate/Competitorn/a
Meas. Tech.ChEMBL_66552 (CHEMBL677819)
Kd 220±n/a nM
Citation Pillai, KMMurray, WVShooshani, IWilliams, DLGordon, DWang, SYJohnson, F Steroids. 2. Synthesis of C-18 functionalized steroids via the Smith-Hughes route. J Med Chem27:1131-7 (1984) Estrogen receptor beta
Name:Estrogen receptor beta
Synonyms:Estrogen receptor
Type:n/a
Mol. Mass.:n/a
Description:ASSAY_ID of ChEMBL is 66549
Components:This complex has 2 components.
Component 1
Name:Estrogen receptor
Type:Enzyme Catalytic Domain
Mol. Mass.:67045.89
Organism:RAT
Description:estrogen alpha 0 RAT::P06211
Residue:600
Component 2
Name:Estrogen receptor beta
Synonyms:ESR2_RAT Esr2 Estrogen receptor beta | Nr3a2
Type:PROTEIN
Mol. Mass.:59173.80
Organism:Rattus norvegicus
Description:ChEMBL_803011
Residue:530
BDBM50225311
NameBDBM50225311
Synonyms:CHEMBL15128
TypeSmall organic molecule
Emp. Form.C20H28O2
Mol. Mass.300.4351
SMILES[H][C@@]12CCC[C@@]1(CC(C)=O)CC[C@]1([H])[C@@]3([H])CCC(=O)C=C3CC[C@@]21[H]