Reaction Details
TargetAlpha-1A/Alpha-1B/Alpha-1D adrenergic receptor
LigandBDBM50019060
Substrate/Competitorn/a
Meas. Tech.ChEMBL_32559 (CHEMBL645694)
Ki 25000±n/a nM
Citation DeBernardis, JFKerkman, DJWinn, MBush, ENArendsen, DLMcClellan, WJKyncl, JJBasha, FZ Conformationally defined adrenergic agents. 1. Design and synthesis of novel alpha 2 selective adrenergic agents: electrostatic repulsion based conformational prototypes. J Med Chem28:1398-404 (1985) Alpha-1A/Alpha-1B/Alpha-1D adrenergic receptor
Name:Alpha-1A/Alpha-1B/Alpha-1D adrenergic receptor
Type:n/a
Mol. Mass.:n/a
Description:ASSAY_ID of EBI is 303470
Components:This complex has 3 components.
Component 1
Name:Alpha-1B adrenergic receptor
Synonyms:ADA1B_RAT Alpha 1B-adrenoceptor Alpha adrenergic receptor 1A and 1B Alpha-1Adrenoceptor Alpha-1B adrenoreceptor | adrenergic Alpha1B
Type:G Protein-Coupled Receptor (GPCR)
Mol. Mass.:56606.71
Organism:Rattus norvegicus (rat)
Description:Receptor binding assays were performed using rat cortical membranes.
Residue:515
Component 2
Name:Alpha-1A adrenergic receptor
Synonyms:ADA1A_RAT Adra1c Alpha-1A adrenoceptor Alpha-1C adrenergic receptor | adrenergic Alpha1A
Type:Protein
Mol. Mass.:51620.15
Organism:Rattus norvegicus (Rat)
Description:P43140
Residue:466
Component 3
Name:Alpha-1D adrenergic receptor
Synonyms:ADA1D_RAT Adra1d Alpha-1D adrenergic receptor | Serotonin 1a (5-HT1a) receptor/Adrenergic receptor alpha-1
Type:Protein
Mol. Mass.:59375.97
Organism:Rattus norvegicus (Rat)
Description:P23944
Residue:561
BDBM50019060
NameBDBM50019060
Synonyms:(+/-)4-(2-Amino-1-hydroxy-ethyl)-3-fluoro-benzene-1,2-diol 4-(2-Amino-1-hydroxy-ethyl)-3-fluoro-benzene-1,2-diol(2-FNE) | CHEMBL287587
TypeSmall organic molecule
Emp. Form.C8H10FNO3
Mol. Mass.187.1683
SMILESNCC(O)c1ccc(O)c(O)c1F