Reaction Details
TargetDihydrofolate reductase type 1
LigandBDBM50291795
Substrate/Competitorn/a
Meas. Tech.ChEMBL_54572 (CHEMBL664886)
Ki 646±n/a nM
Citation Coats, EAGenther, CSSelassie, CDStrong, CDHansch, C Quantitative structure-activity relationship of antifolate inhibition of bacteria cell cultures resistant and sensitive to methotrexate. J Med Chem28:1910-6 (1985) Dihydrofolate reductase type 1
Name:Dihydrofolate reductase type 1
Type:PROTEIN
Mol. Mass.:17574.87
Organism:Escherichia coli
Description:ChEMBL_54248
Residue:157
BDBM50291795
NameBDBM50291795
Synonyms:CHEMBL441503 | {3-[3-(4,6-Diamino-2,2-dimethyl-2H-[1,3,5]triazin-1-yl)-benzyloxy]-phenyl}-methanol
TypeSmall organic molecule
Emp. Form.C19H23N5O2
Mol. Mass.353.4182
SMILESCC1(C)N=C(N)N=C(N)N1c1cccc(COc2cccc(CO)c2)c1