Reaction Details
TargetDihydrofolate reductase type 1
LigandBDBM50291785
Substrate/Competitorn/a
Meas. Tech.ChEMBL_54572 (CHEMBL664886)
Ki 537±n/a nM
Citation Coats, EAGenther, CSSelassie, CDStrong, CDHansch, C Quantitative structure-activity relationship of antifolate inhibition of bacteria cell cultures resistant and sensitive to methotrexate. J Med Chem28:1910-6 (1985) Dihydrofolate reductase type 1
Name:Dihydrofolate reductase type 1
Type:PROTEIN
Mol. Mass.:17574.87
Organism:Escherichia coli
Description:ChEMBL_54248
Residue:157
BDBM50291785
NameBDBM50291785
Synonyms:6,6-Dimethyl-1-(3-m-tolyloxymethyl-phenyl)-1,6-dihydro-[1,3,5]triazine-2,4-diamine | CHEMBL20480
TypeSmall organic molecule
Emp. Form.C19H23N5O
Mol. Mass.337.4188
SMILESCc1cccc(OCc2cccc(c2)N2C(N)=NC(N)=NC2(C)C)c1