Reaction Details
TargetDihydrofolate reductase type 1
LigandBDBM50291794
Substrate/Competitorn/a
Meas. Tech.ChEMBL_54572 (CHEMBL664886)
Ki 436515832±n/a nM
Citation Coats, EAGenther, CSSelassie, CDStrong, CDHansch, C Quantitative structure-activity relationship of antifolate inhibition of bacteria cell cultures resistant and sensitive to methotrexate. J Med Chem28:1910-6 (1985) Dihydrofolate reductase type 1
Name:Dihydrofolate reductase type 1
Type:PROTEIN
Mol. Mass.:17574.87
Organism:Escherichia coli
Description:ChEMBL_54248
Residue:157
BDBM50291794
NameBDBM50291794
Synonyms:6,6-Dimethyl-1-(3-phenylsulfanylmethyl-phenyl)-1,6-dihydro-[1,3,5]triazine-2,4-diamine | CHEMBL21031
TypeSmall organic molecule
Emp. Form.C18H21N5S
Mol. Mass.339.458
SMILESCC1(C)N=C(N)N=C(N)N1c1cccc(CSc2ccccc2)c1