Reaction Details
TargetAlpha-1A/Alpha-1B/Alpha-1D adrenergic receptor
LigandBDBM50019492
Substrate/Competitorn/a
Meas. Tech.ChEMBL_33561 (CHEMBL648423)
Ki 66.0±n/a nM
Citation Welbourn, APChapleo, CBLane, ACMyers, PLRoach, AGSmith, CFStillings, MRTulloch, IF Alpha-adrenoreceptor reagents. 4. Resolution of some potent selective prejunctional alpha 2-adrenoreceptor antagonists. J Med Chem29:2000-3 (1986) Alpha-1A/Alpha-1B/Alpha-1D adrenergic receptor
Name:Alpha-1A/Alpha-1B/Alpha-1D adrenergic receptor
Type:n/a
Mol. Mass.:n/a
Description:ASSAY_ID of EBI is 303470
Components:This complex has 3 components.
Component 1
Name:Alpha-1B adrenergic receptor
Synonyms:ADA1B_RAT Alpha 1B-adrenoceptor Alpha adrenergic receptor 1A and 1B Alpha-1Adrenoceptor Alpha-1B adrenoreceptor | adrenergic Alpha1B
Type:G Protein-Coupled Receptor (GPCR)
Mol. Mass.:56606.71
Organism:Rattus norvegicus (rat)
Description:Receptor binding assays were performed using rat cortical membranes.
Residue:515
Component 2
Name:Alpha-1A adrenergic receptor
Synonyms:ADA1A_RAT Adra1c Alpha-1A adrenoceptor Alpha-1C adrenergic receptor | adrenergic Alpha1A
Type:Protein
Mol. Mass.:51620.15
Organism:Rattus norvegicus (Rat)
Description:P43140
Residue:466
Component 3
Name:Alpha-1D adrenergic receptor
Synonyms:ADA1D_RAT Adra1d Alpha-1D adrenergic receptor | Serotonin 1a (5-HT1a) receptor/Adrenergic receptor alpha-1
Type:Protein
Mol. Mass.:59375.97
Organism:Rattus norvegicus (Rat)
Description:P23944
Residue:561
BDBM50019492
NameBDBM50019492
Synonyms:(+)2-(2-Methoxy-2,3-dihydro-benzo[1,4]dioxin-2-yl)-4,5-dihydro-1H-imidazole 2-(2,3-dihydro-2-methoxy-1,4-benzodioxin-2-yl)-4,5-dihydro-1H-imidazole 2-(2-methoxy-2,3-dihydrobenzo[b][1,4]dioxin-2-yl)-4,5-dihydro-1H-imidazole CHEMBL10332 RX821002
TypeSmall organic molecule
Emp. Form.C12H14N2O3
Mol. Mass.234.2512
SMILESCOC1(COc2ccccc2O1)C1=NCCN1