Reaction Details
TargetVoltage-dependent L-type calcium channel subunit alpha-1S
LigandBDBM50226130
Substrate/Competitorn/a
Meas. Tech.ChEMBL_42923 (CHEMBL654566)
Ki 3.1±n/a nM
Citation Tamazawa, KArima, HKojima, TIsomura, YOkada, MFujita, SFuruya, TTakenaka, TInagaki, OTerai, M Stereoselectivity of a potent calcium antagonist, 1-benzyl-3-pyrrolidinyl methyl 2,6-dimethyl-4-(m-nitrophenyl)-1,4-dihydropyridine-3,5-dicarboxylate. J Med Chem29:2504-11 (1986) Voltage-dependent L-type calcium channel subunit alpha-1S
Name:Voltage-dependent L-type calcium channel subunit alpha-1S
Type:PROTEIN
Mol. Mass.:210392.58
Organism:Rattus norvegicus
Description:ChEMBL_92777
Residue:1850
BDBM50226130
NameBDBM50226130
Synonyms:CHEMBL558616
TypeSmall organic molecule
Emp. Form.C27H30ClN3O6
Mol. Mass.527.997
SMILESCl.[H][C@]1(CCN(Cc2ccccc2)C1)OC(=O)C1=C(C)N=C(C)\C(=C(\O)OC)[C@]1([H])c1cccc(c1)[N+]([O-])=O