Reaction Details
TargetAlpha-1A/Alpha-1B/Alpha-1D adrenergic receptor
LigandBDBM50226155
Substrate/Competitorn/a
Meas. Tech.ChEMBL_32558 (CHEMBL645693)
Ki 400±n/a nM
Citation DeBernardis, JFKyncl, JJBasha, FZArendsen, DLMartin, YCWinn, MKerkman, DJ Conformationally defined adrenergic agents. 2. Catechol imidazoline derivatives: biological effects at alpha 1 and alpha 2 adrenergic receptors. J Med Chem29:463-7 (1986) Alpha-1A/Alpha-1B/Alpha-1D adrenergic receptor
Name:Alpha-1A/Alpha-1B/Alpha-1D adrenergic receptor
Type:n/a
Mol. Mass.:n/a
Description:ASSAY_ID of EBI is 303470
Components:This complex has 3 components.
Component 1
Name:Alpha-1B adrenergic receptor
Synonyms:ADA1B_RAT Alpha 1B-adrenoceptor Alpha adrenergic receptor 1A and 1B Alpha-1Adrenoceptor Alpha-1B adrenoreceptor | adrenergic Alpha1B
Type:G Protein-Coupled Receptor (GPCR)
Mol. Mass.:56606.71
Organism:Rattus norvegicus (rat)
Description:Receptor binding assays were performed using rat cortical membranes.
Residue:515
Component 2
Name:Alpha-1A adrenergic receptor
Synonyms:ADA1A_RAT Adra1c Alpha-1A adrenoceptor Alpha-1C adrenergic receptor | adrenergic Alpha1A
Type:Protein
Mol. Mass.:51620.15
Organism:Rattus norvegicus (Rat)
Description:P43140
Residue:466
Component 3
Name:Alpha-1D adrenergic receptor
Synonyms:ADA1D_RAT Adra1d Alpha-1D adrenergic receptor | Serotonin 1a (5-HT1a) receptor/Adrenergic receptor alpha-1
Type:Protein
Mol. Mass.:59375.97
Organism:Rattus norvegicus (Rat)
Description:P23944
Residue:561
BDBM50226155
NameBDBM50226155
Synonyms:CHEMBL543684
TypeSmall organic molecule
Emp. Form.C13H17BrN2O2
Mol. Mass.313.19
SMILESBr.Oc1ccc2C(CCCc2c1O)C1=NCCN1