Reaction Details
TargetChymotrypsin-like elastase family member 1/2A
LigandBDBM50226398
Substrate/Competitorn/a
Meas. Tech.ChEMBL_158072 (CHEMBL764901)
Ki 82100±n/a nM
Citation Digenis, GAAgha, BJTsuji, KKato, MShinogi, M Peptidyl carbamates incorporating amino acid isosteres as novel elastase inhibitors. J Med Chem29:1468-76 (1986) Chymotrypsin-like elastase family member 1/2A
Name:Chymotrypsin-like elastase family member 1/2A
Synonyms:Pancreatic elastase
Type:n/a
Mol. Mass.:n/a
Description:ASSAY_ID of ChEMBL is 152345
Components:This complex has 2 components.
Component 1
Name:Chymotrypsin-like elastase family member 1
Type:Enzyme
Mol. Mass.:28827.71
Organism:Sus scrofa (Pig)
Description:P00772
Residue:266
Component 2
Name:Chymotrypsin-like elastase family member 2A
Synonyms:CEL2A_PIG ELA2 Elastase 2A Elastase-2A | Pancreatic elastase
Type:PROTEIN
Mol. Mass.:28705.23
Organism:Sus scrofa
Description:ChEMBL_156951
Residue:269
BDBM50226398
NameBDBM50226398
Synonyms:CHEMBL3143926
TypeSmall organic molecule
Emp. Form.C25H35F7N4O8
Mol. Mass.652.5562
SMILESCOC(=O)CCC(=O)N[C@@H](C)C(=O)N[C@@H](C)C(=O)N1CCC[C@H]1C(=O)CN(C(C)C)C(=O)OCC(F)(F)C(F)(F)C(F)(F)F