Reaction Details
TargetAlpha-1A/Alpha-1B/Alpha-1D adrenergic receptor
LigandBDBM50226229
Substrate/Competitorn/a
Meas. Tech.ChEMBL_218069 (CHEMBL821941)
Ki 0.260000±n/a nM
Citation Campbell, SFPlews, RM 2,4-Diamino-6,7-dimethoxyquinazolines. 3. 2-(4-Heterocyclylpiperazin-1-yl) derivatives as alpha 1-adrenoceptor antagonists and antihypertensive agents. J Med Chem30:1794-8 (1987) Alpha-1A/Alpha-1B/Alpha-1D adrenergic receptor
Name:Alpha-1A/Alpha-1B/Alpha-1D adrenergic receptor
Type:n/a
Mol. Mass.:n/a
Description:ASSAY_ID of EBI is 303470
Components:This complex has 3 components.
Component 1
Name:Alpha-1B adrenergic receptor
Synonyms:ADA1B_RAT Alpha 1B-adrenoceptor Alpha adrenergic receptor 1A and 1B Alpha-1Adrenoceptor Alpha-1B adrenoreceptor | adrenergic Alpha1B
Type:G Protein-Coupled Receptor (GPCR)
Mol. Mass.:56606.71
Organism:Rattus norvegicus (rat)
Description:Receptor binding assays were performed using rat cortical membranes.
Residue:515
Component 2
Name:Alpha-1A adrenergic receptor
Synonyms:ADA1A_RAT Adra1c Alpha-1A adrenoceptor Alpha-1C adrenergic receptor | adrenergic Alpha1A
Type:Protein
Mol. Mass.:51620.15
Organism:Rattus norvegicus (Rat)
Description:P43140
Residue:466
Component 3
Name:Alpha-1D adrenergic receptor
Synonyms:ADA1D_RAT Adra1d Alpha-1D adrenergic receptor | Serotonin 1a (5-HT1a) receptor/Adrenergic receptor alpha-1
Type:Protein
Mol. Mass.:59375.97
Organism:Rattus norvegicus (Rat)
Description:P23944
Residue:561
BDBM50226229
NameBDBM50226229
Synonyms:CHEMBL52439
TypeSmall organic molecule
Emp. Form.C18H21N7O2
Mol. Mass.367.405
SMILESCOc1cc2nc(nc(N)c2cc1OC)N1CCN(CC1)c1ncccn1