Reaction Details
TargetDNA topoisomerase 2-beta
LigandBDBM50045004
Substrate/Competitorn/a
Meas. Tech.ChEMBL_75880 (CHEMBL686746)
Ki 4420±n/a nM
Citation Mitscher, LASharma, PNChu, DTShen, LLPernet, AG Chiral DNA gyrase inhibitors. 2. Asymmetric synthesis and biological activity of the enantiomers of 9-fluoro-3-methyl-10-(4-methyl-1-piperazinyl)-7-oxo-2,3-dihydro-7H- pyrido[1,2,3-de]-1,4-benzoxazine-6-carboxylic acid (ofloxacin). J Med Chem30:2283-6 (1987) DNA topoisomerase 2-beta
Name:DNA topoisomerase 2-beta
Type:PROTEIN
Mol. Mass.:183284.13
Organism:Homo sapiens (Human)
Description:ChEMBL_51583
Residue:1626
BDBM50045004
NameBDBM50045004
Synonyms:9-fluoro-3-methyl-10-(4-methylpiperazin-1-yl)-7-oxo-2,3-dihydro-7H-[1,4]oxazino[2,3,4-ij]quinoline-6-carboxylic acid OFLOXACIN | OFLX
TypeSmall organic molecule
Emp. Form.C18H20FN3O4
Mol. Mass.361.3675
SMILESCC1COc2c(N3CCN(C)CC3)c(F)cc3c2n1cc(C(O)=O)c3=O