Reaction Details
TargetDNA topoisomerase 2-beta
LigandBDBM50226409
Substrate/Competitorn/a
Meas. Tech.ChEMBL_75890 (CHEMBL686755)
Ki 290000±n/a nM
Citation Mitscher, LASharma, PNChu, DTShen, LLPernet, AG Chiral DNA gyrase inhibitors. 2. Asymmetric synthesis and biological activity of the enantiomers of 9-fluoro-3-methyl-10-(4-methyl-1-piperazinyl)-7-oxo-2,3-dihydro-7H- pyrido[1,2,3-de]-1,4-benzoxazine-6-carboxylic acid (ofloxacin). J Med Chem30:2283-6 (1987) DNA topoisomerase 2-beta
Name:DNA topoisomerase 2-beta
Type:PROTEIN
Mol. Mass.:183284.13
Organism:Homo sapiens (Human)
Description:ChEMBL_51583
Residue:1626
BDBM50226409
NameBDBM50226409
Synonyms:DEXTROFLOXACINE
TypeSmall organic molecule
Emp. Form.C18H20FN3O4
Mol. Mass.361.3675
SMILESC[C@@H]1COc2c(N3CCN(C)CC3)c(F)cc3c2n1cc(C(O)=O)c3=O