Reaction Details
TargetBeta-1/Beta-2/Beta-3 adrenergic receptor
LigandBDBM50226719
Substrate/Competitorn/a
Meas. Tech.ChEMBL_38749 (CHEMBL857611)
Kd 1.2±n/a nM
Citation Pitha, JBuchowiecki, WMilecki, JKusiak, JW Affinity labels for beta-adrenoceptors: preparation and properties of alkylating beta-blockers derived from indole. J Med Chem30:612-5 (1987) Beta-1/Beta-2/Beta-3 adrenergic receptor
Name:Beta-1/Beta-2/Beta-3 adrenergic receptor
Synonyms:Adrenergic receptor beta
Type:n/a
Mol. Mass.:n/a
Description:ASSAY_ID of ChEMBL is 1340543
Components:This complex has 3 components.
Component 1
Name:Beta-1 adrenergic receptor
Type:Protein
Mol. Mass.:50486.84
Organism:Rattus norvegicus (Rat)
Description:P18090
Residue:466
Component 2
Name:Beta-2 adrenergic receptor
Synonyms:ADRB2_RAT Adrb2r | Adrenergic receptor beta
Type:PROTEIN
Mol. Mass.:46896.26
Organism:Rattus norvegicus
Description:ChEMBL_38603
Residue:418
Component 3
Name:Beta-3 adrenergic receptor
Synonyms:ADRB3_RAT Adrb3r Beta-3 adrenergic receptor
Type:PROTEIN
Mol. Mass.:43161.83
Organism:Rattus norvegicus
Description:ChEMBL_1509452
Residue:400
BDBM50226719
NameBDBM50226719
Synonyms:CHEMBL156754
TypeSmall organic molecule
Emp. Form.C24H33BrN4O3
Mol. Mass.505.448
SMILESCC(C)(NCC(O)COc1cccc2[nH]c(cc12)C#N)C1CCC(C)(CC1)NC(=O)CBr