Reaction Details
TargetCholecystokinin receptor type A/Gastrin/cholecystokinin type B receptor
LigandBDBM50024317
Substrate/Competitorn/a
Meas. Tech.ChEMBL_49552 (CHEMBL664277)
Ki 3.0±n/a nM
Citation Horwell, DCBeeby, AClark, CRHughes, J Synthesis and binding affinities of analogues of cholecystokinin-(30-33) as probes for central nervous system cholecystokinin receptors. J Med Chem30:729-32 (1987) Cholecystokinin receptor type A/Gastrin/cholecystokinin type B receptor
Name:Cholecystokinin receptor type A/Gastrin/cholecystokinin type B receptor
Synonyms:Cholecystokinin receptor
Type:n/a
Mol. Mass.:n/a
Description:ASSAY_ID of ChEMBL is 49552
Components:This complex has 2 components.
Component 1
Name:Cholecystokinin receptor type A
Type:PROTEIN
Mol. Mass.:48454.29
Organism:Mus musculus
Description:ChEMBL_40042
Residue:436
Component 2
Name:Gastrin/cholecystokinin type B receptor
Synonyms:Cckbr Cholecystokinin receptor Gastrin/cholecystokinin type B receptor
Type:Enzyme Catalytic Domain
Mol. Mass.:49196.59
Organism:MOUSE
Description:Cholecystokinin A CCKBR MOUSE::P56481
Residue:453
BDBM50024317
NameBDBM50024317
Synonyms:3-{2-[2-Amino-3-(1H-indol-3-yl)-propionylamino]-4-methylsulfanyl-butyrylamino}-N-(1-carbamoyl-2-phenyl-ethyl)-succinamic acid Tetragastrin
TypeSmall organic molecule
Emp. Form.C29H36N6O6S
Mol. Mass.596.698
SMILESCSCC[C@H](NC(=O)[C@@H](N)Cc1c[nH]c2ccccc12)C(=O)N[C@@H](CC(O)=O)C(=O)N[C@@H](Cc1ccccc1)C(N)=O