Reaction Details
TargetBeta-1/Beta-2/Beta-3 adrenergic receptor
LigandBDBM50226763
Substrate/Competitorn/a
Meas. Tech.ChEMBL_216037 (CHEMBL819744)
Ki>50000±n/a nM
Citation Wu, ESCole, TEDavidson, TABlosser, JCBorrelli, ARKinsolving, CRMilgate, TEParker, RB Flavones. 1. Synthesis and antihypertensive activity of (3-phenylflavonoxy)propanolamines without beta-adrenoceptor antagonism. J Med Chem30:788-92 (1987) Beta-1/Beta-2/Beta-3 adrenergic receptor
Name:Beta-1/Beta-2/Beta-3 adrenergic receptor
Synonyms:Adrenergic receptor beta
Type:n/a
Mol. Mass.:n/a
Description:ASSAY_ID of ChEMBL is 1340543
Components:This complex has 3 components.
Component 1
Name:Beta-1 adrenergic receptor
Type:Protein
Mol. Mass.:50486.84
Organism:Rattus norvegicus (Rat)
Description:P18090
Residue:466
Component 2
Name:Beta-2 adrenergic receptor
Synonyms:ADRB2_RAT Adrb2r | Adrenergic receptor beta
Type:PROTEIN
Mol. Mass.:46896.26
Organism:Rattus norvegicus
Description:ChEMBL_38603
Residue:418
Component 3
Name:Beta-3 adrenergic receptor
Synonyms:ADRB3_RAT Adrb3r Beta-3 adrenergic receptor
Type:PROTEIN
Mol. Mass.:43161.83
Organism:Rattus norvegicus
Description:ChEMBL_1509452
Residue:400
BDBM50226763
NameBDBM50226763
Synonyms:CHEMBL1203804
TypeSmall organic molecule
Emp. Form.C27H28ClNO4
Mol. Mass.465.969
SMILESCl.CC(C)NCC(O)COc1ccc2c(c1)oc(-c1ccccc1)c(-c1ccccc1)c2=O