Reaction Details
TargetSerotonin 2 (5-HT2) receptor
LigandBDBM50064708
Substrate/Competitorn/a
Meas. Tech.ChEMBL_2321 (CHEMBL617528)
Ki 0.390000±n/a nM
Citation Glennon, RATiteler, MSeggel, MRLyon, RA N-methyl derivatives of the 5-HT2 agonist 1-(4-bromo-2,5-dimethoxyphenyl)-2-aminopropane. J Med Chem30:930-2 (1987) Serotonin 2 (5-HT2) receptor
Name:Serotonin 2 (5-HT2) receptor
Synonyms:5-hydroxytryptamine receptor 2A/2B/2C
Type:n/a
Mol. Mass.:n/a
Description:ASSAY_ID of ChEMBL is 2197419
Components:This complex has 3 components.
Component 1
Name:5-hydroxytryptamine receptor 2B
Type:Enzyme Catalytic Domain
Mol. Mass.:53668.47
Organism:RAT
Description:5-HT2B HTR2B RAT::P30994
Residue:479
Component 2
Name:5-hydroxytryptamine receptor 2C
Synonyms:5-HT2C 5-hydroxytryptamine receptor 2C (5HT2c) 5ht1c Htr2c Serotonin receptor 2a and 2c (5HT2A and 5HT2C)
Type:Enzyme
Mol. Mass.:51935.10
Organism:Rattus norvegicus (Rat)
Description:P08909
Residue:460
Component 3
Name:5-hydroxytryptamine receptor 2A
Synonyms:5-HT-2A 5-HT2A 5-hydroxytryptamine receptor 2A (5HT2A) Htr2 Serotonin Receptor 2A
Type:G Protein-Coupled Receptor (GPCR)
Mol. Mass.:52852.05
Organism:Rattus norvegicus (rat)
Description:Rat cortex membranes 5-HT2A receptors.
Residue:471
BDBM50064708
NameBDBM50064708
Synonyms:(R)-1-(4-bromo-2,5-dimethoxyphenyl)propan-2-amine CHEMBL69700
TypeSmall organic molecule
Emp. Form.C11H16BrNO2
Mol. Mass.274.154
SMILESCOc1cc(C[C@@H](C)N)c(OC)cc1Br