Reaction Details
TargetAlpha-2A adrenergic receptor [16-465]/Alpha-2B adrenergic receptor/Alpha-2C adrenergic receptor
LigandBDBM50226958
Substrate/Competitorn/a
Meas. Tech.ChEMBL_34208 (CHEMBL649225)
Ki 38±n/a nM
Citation Hlasta, DJLuttinger, DPerrone, MHSilbernagel, MJWard, SJHaubrich, DR Alpha 2-adrenergic agonists/antagonists: the synthesis and structure-activity relationships of a series of indolin-2-yl and tetrahydroquinolin-2-yl imidazolines. J Med Chem30:1555-62 (1987) Alpha-2A adrenergic receptor [16-465]/Alpha-2B adrenergic receptor/Alpha-2C adrenergic receptor
Name:Alpha-2A adrenergic receptor [16-465]/Alpha-2B adrenergic receptor/Alpha-2C adrenergic receptor
Synonyms:Adrenergic receptor alpha-2
Type:n/a
Mol. Mass.:n/a
Description:ASSAY_ID of ChEMBL is 935397
Components:This complex has 3 components.
Component 1
Name:Alpha-2C adrenergic receptor
Type:Enzyme Catalytic Domain
Mol. Mass.:49890.50
Organism:RAT
Description:adrenergic Alpha2 0 RAT::P22086
Residue:458
Component 2
Name:Alpha-2B adrenergic receptor
Synonyms:ADA2B_RAT Adrenergic receptor alpha Alpha-2B adrenergic receptor Alpha-2B adrenoreceptor | adrenergic Alpha2B
Type:Enzyme Catalytic Domain
Mol. Mass.:50379.83
Organism:NEONATAL RAT
Description:adrenergic Alpha2B ADRA2B NEONATAL RAT::P19328
Residue:453
Component 3
Name:Alpha-2A adrenergic receptor [16-465]
Synonyms:ADA2A_RAT Adrenaline 2 Alpha-2A adrenoceptor Alpha-2AAR Alpha2 Adrenoreceptor adrenergic Alpha2A
Type:G-protein coupled receptor
Mol. Mass.:48961.69
Organism:Rattus norvegicus (rat)
Description:P22909[16-465]
Residue:450
BDBM50226958
NameBDBM50226958
Synonyms:CHEMBL38579
TypeSmall organic molecule
Emp. Form.C14H19N3O
Mol. Mass.245.3202
SMILESCOC[C@]1(Cc2ccccc2N1C)C1=NCCN1