Reaction Details
TargetAlpha-1A/Alpha-1B/Alpha-1D adrenergic receptor
LigandBDBM96939
Substrate/Competitorn/a
Meas. Tech.ChEMBL_34573 (CHEMBL649337)
Ki 4.1±n/a nM
Citation Bordner, JCampbell, SFPalmer, MJTute, MS 1,3-Diamino-6,7-dimethoxyisoquinoline derivatives as potential alpha 1-adrenoceptor antagonists. J Med Chem31:1036-9 (1988) Alpha-1A/Alpha-1B/Alpha-1D adrenergic receptor
Name:Alpha-1A/Alpha-1B/Alpha-1D adrenergic receptor
Type:n/a
Mol. Mass.:n/a
Description:ASSAY_ID of EBI is 303470
Components:This complex has 3 components.
Component 1
Name:Alpha-1B adrenergic receptor
Synonyms:ADA1B_RAT Alpha 1B-adrenoceptor Alpha adrenergic receptor 1A and 1B Alpha-1Adrenoceptor Alpha-1B adrenoreceptor | adrenergic Alpha1B
Type:G Protein-Coupled Receptor (GPCR)
Mol. Mass.:56606.71
Organism:Rattus norvegicus (rat)
Description:Receptor binding assays were performed using rat cortical membranes.
Residue:515
Component 2
Name:Alpha-1A adrenergic receptor
Synonyms:ADA1A_RAT Adra1c Alpha-1A adrenoceptor Alpha-1C adrenergic receptor | adrenergic Alpha1A
Type:Protein
Mol. Mass.:51620.15
Organism:Rattus norvegicus (Rat)
Description:P43140
Residue:466
Component 3
Name:Alpha-1D adrenergic receptor
Synonyms:ADA1D_RAT Adra1d Alpha-1D adrenergic receptor | Serotonin 1a (5-HT1a) receptor/Adrenergic receptor alpha-1
Type:Protein
Mol. Mass.:59375.97
Organism:Rattus norvegicus (Rat)
Description:P23944
Residue:561
BDBM96939
NameBDBM96939
Synonyms:(4-amino-6,7-dimethoxy-quinazolin-2-yl)-dimethyl-amine;hydrochloride 6,7-dimethoxy-N2,N2-dimethyl-quinazoline-2,4-diamine;hydrochloride 6,7-dimethoxy-N~2~,N~2~-dimethylquinazoline-2,4-diamine SMR000033893 | cid_6602978
TypeSmall organic molecule
Emp. Form.C12H16N4O2
Mol. Mass.248.281
SMILESCOc1cc2nc(nc(N)c2cc1OC)N(C)C