Reaction Details
TargetLactoylglutathione lyase
LigandBDBM7461
Substrate/Competitorn/a
Meas. Tech.ChEMBL_71295 (CHEMBL684310)
Ki 83200±n/a nM
Citation Doweyko, AM The hypothetical active site lattice. An approach to modelling active sites from data on inhibitor molecules. J Med Chem31:1396-406 (1988) Lactoylglutathione lyase
Name:Lactoylglutathione lyase
Type:Enzyme
Mol. Mass.:20772.95
Organism:Homo sapiens (Human)
Description:Q04760
Residue:184
BDBM7461
NameBDBM7461
Synonyms:5,7-dihydroxy-2-phenyl-4H-chromen-4-one 5,7-dihydroxyflavone chrysin | cid_5281607
TypeSmall organic molecule
Emp. Form.C15H10O4
Mol. Mass.254.2375
SMILESOc1cc(O)c2c(c1)oc(cc2=O)-c1ccccc1