Reaction Details
TargetDihydrofolate reductase
LigandBDBM50391257
Substrate/Competitorn/a
Meas. Tech.ChEMBL_54735 (CHEMBL667186)
Ki 0.490±n/a nM
Citation Doweyko, AM The hypothetical active site lattice. An approach to modelling active sites from data on inhibitor molecules. J Med Chem31:1396-406 (1988) Dihydrofolate reductase
Name:Dihydrofolate reductase
Type:n/a
Mol. Mass.:17532.46
Organism:Escherichia coli
Description:n/a
Residue:157
BDBM50391257
NameBDBM50391257
Synonyms:CHEMBL30938 | Ro-17-3279
TypeSmall organic molecule
Emp. Form.C19H25N5O2
Mol. Mass.355.4341
SMILESCOc1cc(OC)cc(c1)N1C2CCC1CC(C2)c1cnc(N)nc1N