Reaction Details
TargetDihydrofolate reductase
LigandBDBM50027970
Substrate/Competitorn/a
Meas. Tech.ChEMBL_54735 (CHEMBL667186)
Ki 0.603±n/a nM
Citation Doweyko, AM The hypothetical active site lattice. An approach to modelling active sites from data on inhibitor molecules. J Med Chem31:1396-406 (1988) Dihydrofolate reductase
Name:Dihydrofolate reductase
Type:n/a
Mol. Mass.:17532.46
Organism:Escherichia coli
Description:n/a
Residue:157
BDBM50027970
NameBDBM50027970
Synonyms:5-(4-Bromo-3,5-dimethoxy-benzyl)-pyrimidine-2,4-diamine CHEMBL31891
TypeSmall organic molecule
Emp. Form.C13H15BrN4O2
Mol. Mass.339.188
SMILESCOc1cc(Cc2cnc(N)nc2N)cc(OC)c1Br