Reaction Details
TargetEstrogen receptor beta
LigandBDBM50227469
Substrate/Competitorn/a
Meas. Tech.ChEMBL_66541 (CHEMBL677808)
EC50 170±n/a nM
Citation Ruenitz, PCBagley, JRNanavati, NT Synthesis and estrogen receptor selectivity of 1,1-bis(4-hydroxyphenyl)-2-(p-halophenyl)ethylenes. J Med Chem31:1471-5 (1988) Estrogen receptor beta
Name:Estrogen receptor beta
Synonyms:Estrogen receptor
Type:n/a
Mol. Mass.:n/a
Description:ASSAY_ID of ChEMBL is 66549
Components:This complex has 2 components.
Component 1
Name:Estrogen receptor
Type:Enzyme Catalytic Domain
Mol. Mass.:67045.89
Organism:RAT
Description:estrogen alpha 0 RAT::P06211
Residue:600
Component 2
Name:Estrogen receptor beta
Synonyms:ESR2_RAT Esr2 Estrogen receptor beta | Nr3a2
Type:PROTEIN
Mol. Mass.:59173.80
Organism:Rattus norvegicus
Description:ChEMBL_803011
Residue:530
BDBM50227469
NameBDBM50227469
Synonyms:CHEMBL285536
TypeSmall organic molecule
Emp. Form.C20H15FO2
Mol. Mass.306.3303
SMILES[#8]-c1ccc(cc1)-[#6](=[#6]\c1ccc(F)cc1)\c1ccc(-[#8])cc1