Reaction Details
TargetVoltage-dependent L-type calcium channel subunit alpha-1S
LigandBDBM50227967
Substrate/Competitorn/a
Meas. Tech.ChEMBL_214797 (CHEMBL815533)
IC50 2.1±n/a nM
Citation Cho, HUeda, MShima, KMizuno, AHayashimatsu, MOhnaka, YTakeuchi, YHamaguchi, MAisaka, KHidaka, T Dihydropyrimidines: novel calcium antagonists with potent and long-lasting vasodilative and antihypertensive activity. J Med Chem32:2399-406 (1989) Voltage-dependent L-type calcium channel subunit alpha-1S
Name:Voltage-dependent L-type calcium channel subunit alpha-1S
Type:PROTEIN
Mol. Mass.:210392.58
Organism:Rattus norvegicus
Description:ChEMBL_92777
Residue:1850
BDBM50227967
NameBDBM50227967
Synonyms:CHEMBL78973
TypeSmall organic molecule
Emp. Form.C33H34Cl2N4O6
Mol. Mass.653.552
SMILESCC(C)OC(=O)C1=C(C)N=C(C)N(C1c1ccccc1[N+]([O-])=O)C(=O)OCCN(Cc1ccccc1)Cc1ccc(Cl)c(Cl)c1