Reaction Details
TargetMuscarinic acetylcholine receptor M5
LigandBDBM50228206
Substrate/Competitorn/a
Meas. Tech.ChEMBL_138640 (CHEMBL749271)
IC50 3.3±n/a nM
Citation Wilson, AADannals, RFRavert, HTFrost, JJWagner, HN Synthesis and biological evaluation of [125I]- and [123I]-4-iododexetimide, a potent muscarinic cholinergic receptor antagonist. J Med Chem32:1057-62 (1989) Muscarinic acetylcholine receptor M5
Name:Muscarinic acetylcholine receptor M5
Type:PROTEIN
Mol. Mass.:60282.66
Organism:Mus musculus
Description:ChEMBL_104873
Residue:532
BDBM50228206
NameBDBM50228206
Synonyms:Dexetimide | R-16470 [as hydrochloride]
TypeSmall organic molecule
Emp. Form.C23H26N2O2
Mol. Mass.362.4647
SMILESO=C1CC[C@@](C2CCN(Cc3ccccc3)CC2)(C(=O)N1)c1ccccc1