Reaction Details
TargetD(1A) dopamine receptor
LigandBDBM50038350
Substrate/Competitorn/a
Meas. Tech.ChEMBL_58977 (CHEMBL668642)
Ki 447±n/a nM
Citation Charifson, PSBowen, JPWyrick, SDHoffman, AJCory, MMcPhail, ATMailman, RB Conformational analysis and molecular modeling of 1-phenyl-, 4-phenyl-, and 1-benzyl-1,2,3,4-tetrahydroisoquinolines as D1 dopamine receptor ligands. J Med Chem32:2050-8 (1989) D(1A) dopamine receptor
Name:D(1A) dopamine receptor
Type:Enzyme
Mol. Mass.:49303.43
Organism:Homo sapiens (Human)
Description:P21728
Residue:446
BDBM50038350
NameBDBM50038350
Synonyms:(R)-6-Chloro-2-methyl-1-phenyl-1,2,3,4-tetrahydro-isoquinolin-7-ol CHEMBL293158
TypeSmall organic molecule
Emp. Form.C16H16ClNO
Mol. Mass.273.757
SMILESCN1CCc2cc(Cl)c(O)cc2[C@H]1c1ccccc1