Reaction Details
TargetD(1A) dopamine receptor
LigandBDBM50228321
Substrate/Competitorn/a
Meas. Tech.ChEMBL_58977 (CHEMBL668642)
Ki 87±n/a nM
Citation Charifson, PSBowen, JPWyrick, SDHoffman, AJCory, MMcPhail, ATMailman, RB Conformational analysis and molecular modeling of 1-phenyl-, 4-phenyl-, and 1-benzyl-1,2,3,4-tetrahydroisoquinolines as D1 dopamine receptor ligands. J Med Chem32:2050-8 (1989) D(1A) dopamine receptor
Name:D(1A) dopamine receptor
Type:Enzyme
Mol. Mass.:49303.43
Organism:Homo sapiens (Human)
Description:P21728
Residue:446
BDBM50228321
NameBDBM50228321
Synonyms:CHEMBL302393
TypeSmall organic molecule
Emp. Form.C16H16ClNO
Mol. Mass.273.757
SMILESCN1C[C@@H](c2ccccc2)c2cc(O)c(Cl)cc2C1