Reaction Details
TargetD(2) dopamine receptor
LigandBDBM50038349
Substrate/Competitorn/a
Meas. Tech.ChEMBL_61146 (CHEMBL670683)
Ki 1862±n/a nM
Citation Charifson, PSBowen, JPWyrick, SDHoffman, AJCory, MMcPhail, ATMailman, RB Conformational analysis and molecular modeling of 1-phenyl-, 4-phenyl-, and 1-benzyl-1,2,3,4-tetrahydroisoquinolines as D1 dopamine receptor ligands. J Med Chem32:2050-8 (1989) D(2) dopamine receptor
Name:D(2) dopamine receptor
Type:Cell-surface receptors
Mol. Mass.:50647.10
Organism:Homo sapiens (Human)
Description:P14416
Residue:443
BDBM50038349
NameBDBM50038349
Synonyms:(S)-6-Chloro-2-methyl-1-phenyl-1,2,3,4-tetrahydro-isoquinolin-7-ol CHEMBL303993
TypeSmall organic molecule
Emp. Form.C16H16ClNO
Mol. Mass.273.757
SMILESCN1CCc2cc(Cl)c(O)cc2[C@@H]1c1ccccc1