Reaction Details
Target5-hydroxytryptamine receptor 3A/3B
LigandBDBM50000492
Substrate/Competitorn/a
Meas. Tech.ChEMBL_3109 (CHEMBL620587)
Ki 1.3±n/a nM
Citation Rosen, TSeeger, TFMcLean, SNagel, AAIves, JLGuarino, KJBryce, DFurman, JRoth, RWChalabi, PM Synthesis, in vitro binding profile, and central nervous system penetrability of the highly potent 5-HT3 receptor antagonist [3H]-4-(2-methoxyphenyl)-2-[4(5)-methyl-5(4)-imidazolylmethyl]thiazole. J Med Chem33:3020-3 (1990) 5-hydroxytryptamine receptor 3A/3B
Name:5-hydroxytryptamine receptor 3A/3B
Synonyms:Serotonin 3 receptor (5HT3)
Type:n/a
Mol. Mass.:n/a
Description:ASSAY_ID of ChEMBL is 357762
Components:This complex has 2 components.
Component 1
Name:5-hydroxytryptamine receptor 3A
Type:n/a
Mol. Mass.:56056.00
Organism:Mus musculus (house mouse)
Description:5HT3A
Residue:487
Component 2
Name:5-hydroxytryptamine receptor 3B
Synonyms:5HT3B_MOUSE Serotonin 3 receptor (5HT3) | Serotonin 3b (5-HT3b) receptor
Type:PROTEIN
Mol. Mass.:50317.35
Organism:Mus musculus
Description:ChEMBL_3121
Residue:437
BDBM50000492
NameBDBM50000492
Synonyms:(zacopride)4-Amino-N-(1-aza-bicyclo[2.2.2]oct-3-yl)-5-chloro-2-methoxy-benzamide 4-Amino-N-(1-aza-bicyclo[2.2.2]oct-3-yl)-5-chloro-2-methoxy-benzamide (Zacopride) CHEMBL18041 ZACOPRIDE ZACOPRIDE,RS | ZACOPRIDE,S
TypeSmall organic molecule
Emp. Form.C15H20ClN3O2
Mol. Mass.309.791
SMILESCOc1cc(N)c(Cl)cc1C(=O)NC1CN2CCC1CC2