Reaction Details
Target5-hydroxytryptamine receptor 1A
LigandBDBM66983
Substrate/Competitorn/a
Meas. Tech.ChEMBL_1505 (CHEMBL616337)
Ki 100±n/a nM
Citation Clark, RDWeinhardt, KKBerger, JFisher, LEBrown, CMMacKinnon, ACKilpatrick, ATSpedding, M 1,9-Alkano-bridged 2,3,4,5-tetrahydro-1H-3-benzazepines with affinity for the alpha 2-adrenoceptor and the 5-HT1A receptor. J Med Chem33:633-41 (1990) 5-hydroxytryptamine receptor 1A
Name:5-hydroxytryptamine receptor 1A
Type:G Protein-Coupled Receptor (GPCR)
Mol. Mass.:46445.29
Organism:Rattus norvegicus (rat)
Description:Binding assays were performed using rat hippocampal membranes.
Residue:422
BDBM66983
NameBDBM66983
Synonyms:6-chloranyl-3-methyl-1,2,4,5-tetrahydro-3-benzazepine;hydrochloride CHEMBL123349 SKF 86466 SMR001254100 | cid_10220250
TypeSmall organic molecule
Emp. Form.C11H14ClN
Mol. Mass.195.689
SMILESCN1CCc2cccc(Cl)c2CC1