Reaction Details
Target5-hydroxytryptamine receptor 1A/1B/1D/1E/1F/2A/2B/2C/3A/3B/3C/3D/3E/4/5A/6/7
LigandBDBM50022536
Substrate/Competitorn/a
Meas. Tech.ChEMBL_198193 (CHEMBL799121)
IC50 660693±n/a nM
Citation Miller, DDHamada, AClark, MTAdejare, APatil, PNShams, GRomstedt, KJKim, SUIntrasuksri, UMcKenzie, JL Synthesis and alpha 2-adrenoceptor effects of substituted catecholimidazoline and catecholimidazole analogues in human platelets. J Med Chem33:1138-44 (1990) 5-hydroxytryptamine receptor 1A/1B/1D/1E/1F/2A/2B/2C/3A/3B/3C/3D/3E/4/5A/6/7
Name:5-hydroxytryptamine receptor 1A/1B/1D/1E/1F/2A/2B/2C/3A/3B/3C/3D/3E/4/5A/6/7
Synonyms:Serotonin (5-HT) receptor
Type:n/a
Mol. Mass.:n/a
Description:ASSAY_ID of ChEMBL is 1570012
Components:This complex has 17 components.
Component 1
Name:5-hydroxytryptamine receptor 5A
Type:Enzyme
Mol. Mass.:40266.25
Organism:Homo sapiens (Human)
Description:P47898
Residue:357
Component 2
Name:5-hydroxytryptamine receptor 6
Synonyms:5-HT-6 5-hydroxytryptamine receptor 6 (5-HT-6) 5-hydroxytryptamine receptor 6 (5HT6) HTR6 Serotonin 6 (5-HT6) receptor | Serotonin Receptor 6
Type:G Protein-Coupled Receptor (GPCR)
Mol. Mass.:46968.43
Organism:Homo sapiens (Human)
Description:P50406
Residue:440
Component 3
Name:5-hydroxytryptamine receptor 1F
Synonyms:5-HT-1F 5-hydroxytryptamine receptor 1F HTR1EL Serotonin (5-HT) receptor Serotonin receptor 1F
Type:Enzyme Catalytic Domain
Mol. Mass.:41724.68
Organism:Homo sapiens (Human)
Description:5-HT1F HTR1F HUMAN::P30939
Residue:366
Component 4
Name:5-hydroxytryptamine receptor 3B
Synonyms:5-HT-3B 5-hydroxytryptamine receptor 3B HTR3B Serotonin receptor 3B
Type:PROTEIN
Mol. Mass.:50281.60
Organism:Homo sapiens (Human)
Description:EBI_11305
Residue:441
Component 5
Name:5-hydroxytryptamine receptor 3A
Synonyms:5-HT-3 5-HT3A 5-hydroxytryptamine receptor 3 (5-HT3) 5-hydroxytryptamine receptor 3A (5HT3A) 5HT3R HTR3A Serotonin 3 receptor (5HT3) Serotonin-gated ion channel receptor | Serotonin-gated ion channel receptor 3
Type:Protein
Mol. Mass.:55283.27
Organism:Homo sapiens (Human)
Description:P46098
Residue:478
Component 6
Name:5-hydroxytryptamine receptor 3C
Synonyms:5HT3C_HUMAN Serotonin (5-HT3) receptor
Type:PROTEIN
Mol. Mass.:50216.00
Organism:Homo sapiens (Human)
Description:EBI_12117
Residue:447
Component 7
Name:5-hydroxytryptamine receptor 1B
Synonyms:5-HT-1B 5-HT1B 5HT1B_HUMAN HTR1DB Serotonin (5-HT) receptor Serotonin Receptor 1B
Type:G Protein-Coupled Receptor (GPCR)
Mol. Mass.:43579.17
Organism:Homo sapiens (Human)
Description:Receptor binding assays were performed using human clone stably expressed in CHO cells
Residue:390
Component 8
Name:5-hydroxytryptamine receptor 2B
Synonyms:5-HT-2B 5-hydroxytryptamine (serotonin) receptor 2B [Homo sapiens] 5-hydroxytryptamine receptor 2C (5HT2C) HTR2B Serotonin 2b (5-HT2b) receptor | Serotonin Receptor 2B
Type:G Protein-Coupled Receptor (GPCR)
Mol. Mass.:54312.47
Organism:Homo sapiens (Human)
Description:Receptor binding assays were performed using human clone stably expressed in CHO cells.
Residue:481
Component 9
Name:5-hydroxytryptamine receptor 2C
Synonyms:5-HT-2C 5-HT2C-INI 5-HTR2C 5-hydroxytryptamine receptor 2C (5-HT-2C) 5HT-1C HTR1C Serotonin (5-HT3) receptor Serotonin Receptor 2C
Type:G Protein-Coupled Receptor (GPCR)
Mol. Mass.:51836.79
Organism:Homo sapiens (Human)
Description:P28335
Residue:458
Component 10
Name:5-hydroxytryptamine receptor 1E
Synonyms:5-HT-1E 5-Hydroxytryptamine Receptor Subtype 1E (5HT1E) 5-hydroxytryptamine receptor 1E (5-HT-1E) (S31) 5HT1E_HUMAN S31 Serotonin 1e (5-HT1e) receptor | Serotonin Receptor 1E
Type:G Protein-Coupled Receptor (GPCR)
Mol. Mass.:41697.80
Organism:Homo sapiens (Human)
Description:gi_112822
Residue:365
Component 11
Name:5-hydroxytryptamine receptor 1D
Synonyms:5-HT-1D 5-HT1D 5HT1D_HUMAN HTR1DA Serotonin (5-HT) receptor | Serotonin Receptor 1D
Type:G Protein-Coupled Receptor (GPCR)
Mol. Mass.:41920.63
Organism:Homo sapiens (Human)
Description:Receptor binding assays were performed using human clone stably expressed in CHO cells.
Residue:377
Component 12
Name:5-hydroxytryptamine receptor 1A
Synonyms:5-HT-1A 5-hydroxytryptamine receptor 1A (5-HT-1A) ADRB2RL1 Dopamine D2 receptor and serotonin 1a receptor HTR1A | Serotonin receptor 1A
Type:n/a
Mol. Mass.:46122.49
Organism:Homo sapiens (Human)
Description:n/a
Residue:422
Component 13
Name:5-hydroxytryptamine receptor 2A
Synonyms:5-HT-2 5-HT2A 5-hydroxytryptamine receptor 2A (5HT-2A) 5HT2A_HUMAN HTR2A | Serotonin receptor 2A
Type:undefined
Mol. Mass.:52607.65
Organism:Homo sapiens (Human)
Description:P28223
Residue:471
Component 14
Name:5-hydroxytryptamine receptor 4
Synonyms:5-HT-4 5-HT4S 5-HT4b 5-HT4d 5-hydroxytryptamine receptor 4 5HT4R_HUMAN Serotonin (5-HT) receptor Serotonin 4 (5-HT4) receptor | Serotonin Receptor 4
Type:Enzyme
Mol. Mass.:43767.54
Organism:Homo sapiens (Human)
Description:Q13639
Residue:388
Component 15
Name:5-hydroxytryptamine receptor 7
Synonyms:5-HT-7 5-HT7 5-HT7S 5HT7 HTR7 | Serotonin receptor 7
Type:G Protein-Coupled Receptor (GPCR)
Mol. Mass.:53573.08
Organism:Homo sapiens (Human)
Description:P34969
Residue:479
Component 16
Name:5-hydroxytryptamine receptor 3D
Synonyms:5HT3D_HUMAN Serotonin (5-HT3) receptor
Type:PROTEIN
Mol. Mass.:50209.16
Organism:Homo sapiens (Human)
Description:EBI_12960
Residue:454
Component 17
Name:5-hydroxytryptamine receptor 3E
Synonyms:5HT3E_HUMAN Serotonin (5-HT3) receptor
Type:PROTEIN
Mol. Mass.:51440.34
Organism:Homo sapiens (Human)
Description:EBI_14002
Residue:456
BDBM50022536
NameBDBM50022536
Synonyms:CHEMBL15228
TypeSmall organic molecule
Emp. Form.C10H11ClN2O2
Mol. Mass.226.66
SMILESCl.Oc1ccc(Cc2ncc[nH]2)cc1O