Reaction Details
TargetcAMP-dependent protein kinase catalytic subunit gamma
LigandBDBM15203
Substrate/Competitorn/a
Meas. Tech.ChEMBL_161403 (CHEMBL768312)
IC50 6000±n/a nM
Citation Ricouart, AGesquiere, JCTartar, ASergheraert, C Design of potent protein kinase inhibitors using the bisubstrate approach. J Med Chem34:73-8 (1991) cAMP-dependent protein kinase catalytic subunit gamma
Name:cAMP-dependent protein kinase catalytic subunit gamma
Type:PROTEIN
Mol. Mass.:40442.03
Organism:Homo sapiens (Human)
Description:ChEMBL_104720
Residue:351
BDBM15203
NameBDBM15203
Synonyms:5-(piperazine-1-sulfonyl)isoquinoline Isoquinoline-5-sulfonic acid piperazin-1 ylamide | isoquinoline-5-sulfonamide 18
TypeSmall organic molecule
Emp. Form.C13H15N3O2S
Mol. Mass.277.342
SMILESO=S(=O)(N1CCNCC1)c1cccc2cnccc12