Reaction Details
TargetCarbonic anhydrase 1/12/13/14/2/3/4/5A, mitochondrial/5B, mitochondrial/6/7/9
LigandBDBM50229845
Substrate/Competitorn/a
Meas. Tech.ChEMBL_47330 (CHEMBL659668)
IC50 520±n/a nM
Citation Antonaroli, SBianco, ABrufani, MCellai, LLo Baido, GPotier, EBonomi, LPerfetti, SFiaschi, AISegre, G Acetazolamide-like carbonic anhydrase inhibitors with topical ocular hypotensive activity. J Med Chem35:2697-703 (1992) Carbonic anhydrase 1/12/13/14/2/3/4/5A, mitochondrial/5B, mitochondrial/6/7/9
Name:Carbonic anhydrase 1/12/13/14/2/3/4/5A, mitochondrial/5B, mitochondrial/6/7/9
Synonyms:Carbonic anhydrase
Type:n/a
Mol. Mass.:n/a
Description:ASSAY_ID of ChEMBL is 1439798
Components:This complex has 12 components.
Component 1
Name:Carbonic anhydrase 9
Type:Enzyme
Mol. Mass.:49669.03
Organism:Homo sapiens (Human)
Description:Catalytic domain of human cloned isozyme was used in the assay
Residue:459
Component 2
Name:Carbonic anhydrase 6
Synonyms:CA-VI CAH6_HUMAN Carbonic Anhydrase VI Carbonic anhydrase 6 Carbonic anhydrase 6 (CA-VI) Salivary carbonic anhydrase | Secreted carbonic anhydrase
Type:Enzyme
Mol. Mass.:35371.40
Organism:Homo sapiens (Human)
Description:P23280
Residue:308
Component 3
Name:Carbonic anhydrase 12
Synonyms:CA-XII CAH12_HUMAN Carbonic anhydrase Carbonic anhydrase XII Carbonic anhydrase XII (CAXII) | Tumor antigen HOM-RCC-3.1.3
Type:Enzyme
Mol. Mass.:39456.00
Organism:Homo sapiens (Human)
Description:Catalytic domain of human cloned isozyme was used in the assay
Residue:354
Component 4
Name:Carbonic anhydrase 1
Synonyms:CA-I CAB Carbonate dehydratase I Carbonic anhydrase 1 (CA I) Carbonic anhydrase 1 (Recombinant CA I) Carbonic anhydrase B Carbonic anhydrase I (CA I) Carbonic anhydrase I (CAI) Carbonic anhydrase isoenzyme I (hCA I) | hCA
Type:Enzyme
Mol. Mass.:28873.37
Organism:Homo sapiens (Human)
Description:P00915
Residue:261
Component 5
Name:Carbonic anhydrase 13
Synonyms:CA13 Carbonic anhydrase Carbonic anhydrase XIII (CA XIII)
Type:Enzyme
Mol. Mass.:29445.78
Organism:Homo sapiens (Human)
Description:Q8N1Q1
Residue:262
Component 6
Name:Carbonic anhydrase 2
Synonyms:CA-II CAC Carbonate dehydratase II Carbonic anhydrase 2 (CA-II) Carbonic anhydrase C Carbonic anhydrase II (CA-II) Carbonic anhydrase II (hCA II) | Carbonic anhydrase isoenzyme II (hCA II)
Type:Enzyme
Mol. Mass.:29250.71
Organism:Homo sapiens (Human)
Description:P00918
Residue:260
Component 7
Name:Carbonic anhydrase 3
Synonyms:CA-III CAH3_HUMAN Carbonic Anhydrase III Carbonic anhydrase 3 (CA III) | Carbonic anhydrase III (CA III)
Type:Enzyme
Mol. Mass.:29562.11
Organism:Homo sapiens (Human)
Description:Human cloned isozyme.
Residue:260
Component 8
Name:Carbonic anhydrase 5B, mitochondrial
Synonyms:CA-VB CAH5B_HUMAN Carbonic Anhydrase VB Carbonic anhydrase 5B, mitochondrial Carbonic anhydrase V | Carbonic anhydrase VB (CA VB)
Type:Enzyme
Mol. Mass.:36440.83
Organism:Homo sapiens (Human)
Description:Human (cloned) isozyme
Residue:317
Component 9
Name:Carbonic anhydrase 7
Synonyms:CA-VII CAH7_HUMAN Carbonic anhydrase Carbonic anhydrase VII (CA VII)
Type:Enzyme
Mol. Mass.:29664.11
Organism:Homo sapiens (Human)
Description:Human cloned isozyme.
Residue:264
Component 10
Name:Carbonic anhydrase 5A, mitochondrial
Synonyms:CA-VA CA5A Carbonate dehydratase VA Carbonic anhydrase 5A (CA VA) Carbonic anhydrase 5A, mitochondrial precursor Carbonic anhydrase VA (CA VA)
Type:Enzyme
Mol. Mass.:34755.54
Organism:Homo sapiens (Human)
Description:Human (cloned) isozyme
Residue:305
Component 11
Name:Carbonic anhydrase 14
Synonyms:CA-XIV CAH14_HUMAN Carbonic Anhydrase XIV Carbonic anhydrase 14 Carbonic anhydrase XIV (CA XIV)
Type:Enzyme
Mol. Mass.:37665.67
Organism:Homo sapiens (Human)
Description:Human (cloned) isozyme.
Residue:337
Component 12
Name:Carbonic anhydrase 4
Synonyms:CA-IV CAH4_HUMAN Carbonic anhydrase Carbonic anhydrase IV (CA IV)
Type:Enzyme
Mol. Mass.:35037.98
Organism:Homo sapiens (Human)
Description:P22748
Residue:312
BDBM50229845
NameBDBM50229845
Synonyms:CHEMBL91517
TypeSmall organic molecule
Emp. Form.C7H10N4O5S2
Mol. Mass.294.308
SMILESNS(=O)(=O)c1nnc(NC(=O)CCCC(O)=O)s1