Reaction Details
TargetDual specificity calcium/calmodulin-dependent 3',5'-cyclic nucleotide phosphodiesterase 1B
LigandBDBM50229878
Substrate/Competitorn/a
Meas. Tech.ChEMBL_155690 (CHEMBL766267)
IC50 70000±n/a nM
Citation Bonnet, PAMichel, ALaurent, FSablayrolles, CRechencq, EMani, JCBoucard, MChapat, JP Synthesis and antibronchospastic activity of 8-alkoxy- and 8-(alkylamino)imidazo[1,2-a]pyrazines. J Med Chem35:3353-8 (1992) Dual specificity calcium/calmodulin-dependent 3',5'-cyclic nucleotide phosphodiesterase 1B
Name:Dual specificity calcium/calmodulin-dependent 3',5'-cyclic nucleotide phosphodiesterase 1B
Type:PROTEIN
Mol. Mass.:60991.90
Organism:Bos taurus
Description:ChEMBL_104913
Residue:534
BDBM50229878
NameBDBM50229878
Synonyms:CHEMBL112904
TypeSmall organic molecule
Emp. Form.C8H6BrN5
Mol. Mass.252.071
SMILESCNc1nc(Br)cn2cc(nc12)C#N