Reaction Details
TargetDual specificity calcium/calmodulin-dependent 3',5'-cyclic nucleotide phosphodiesterase 1B
LigandBDBM50229882
Substrate/Competitorn/a
Meas. Tech.ChEMBL_155689 (CHEMBL764359)
IC50 267000±n/a nM
Citation Bonnet, PAMichel, ALaurent, FSablayrolles, CRechencq, EMani, JCBoucard, MChapat, JP Synthesis and antibronchospastic activity of 8-alkoxy- and 8-(alkylamino)imidazo[1,2-a]pyrazines. J Med Chem35:3353-8 (1992) Dual specificity calcium/calmodulin-dependent 3',5'-cyclic nucleotide phosphodiesterase 1B
Name:Dual specificity calcium/calmodulin-dependent 3',5'-cyclic nucleotide phosphodiesterase 1B
Type:PROTEIN
Mol. Mass.:60991.90
Organism:Bos taurus
Description:ChEMBL_104913
Residue:534
BDBM50229882
NameBDBM50229882
Synonyms:CHEMBL111902
TypeSmall organic molecule
Emp. Form.C6H5BrN4
Mol. Mass.213.035
SMILESNc1nc(Br)cn2ccnc12