Reaction Details
TargetCannabinoid receptor 1/2
LigandBDBM21281
Substrate/Competitorn/a
Meas. Tech.ChEMBL_46144 (CHEMBL660017)
IC50 5.6±n/a nM
Citation D'Ambra, TEEstep, KGBell, MREissenstat, MAJosef, KAWard, SJHaycock, DABaizman, ERCasiano, FMBeglin, NC Conformationally restrained analogues of pravadoline: nanomolar potent, enantioselective, (aminoalkyl)indole agonists of the cannabinoid receptor. J Med Chem35:124-35 (1992) Cannabinoid receptor 1/2
Name:Cannabinoid receptor 1/2
Synonyms:Cannabinoid receptor
Type:n/a
Mol. Mass.:n/a
Description:ASSAY_ID of ChEMBL is 1859866
Components:This complex has 2 components.
Component 1
Name:Cannabinoid receptor 2
Type:Enzyme
Mol. Mass.:39366.68
Organism:Rattus norvegicus (Rat)
Description:Q9QZN9
Residue:360
Component 2
Name:Cannabinoid receptor 1
Synonyms:Brain-type cannabinoid receptor CB-R CNR1_RAT Cannabinoid receptor Cnr1 | Skr6
Type:G Protein-Coupled Receptor (GPCR)
Mol. Mass.:52856.55
Organism:Rattus norvegicus (rat)
Description:P20272
Residue:473
BDBM21281
NameBDBM21281
Synonyms:(11R)-2-methyl-11-(morpholin-4-ylmethyl)-3-(naphthalen-1-ylcarbonyl)-9-oxa-1-azatricyclo[6.3.1.0^{4,12}]dodeca-2,4(12),5,7-tetraene CHEMBL188 WIN 55212-2 WIN55212-2
TypeAnalgesic
Emp. Form.C27H26N2O3
Mol. Mass.426.5069
SMILESCc1c(C(=O)c2cccc3ccccc23)c2cccc3OC[C@@H](CN4CCOCC4)n1c23