Reaction Details
TargetLutropin-choriogonadotropic hormone receptor
LigandBDBM50230129
Substrate/Competitorn/a
Meas. Tech.ChEMBL_100017 (CHEMBL709254)
Ki 0.042658±n/a nM
Citation Haviy, FFitzpatrick, TDNichols, CJSwenson, REBush, ENDiaz, GNguyen, ANellans, HNHoffman, DJGhanbari, H Stabilization of the N-terminal residues of luteinizing hormone-releasing hormone agonists and the effect on pharmacokinetics. J Med Chem35:3890-4 (1992) Lutropin-choriogonadotropic hormone receptor
Name:Lutropin-choriogonadotropic hormone receptor
Type:PROTEIN
Mol. Mass.:78049.26
Organism:Rattus norvegicus
Description:ChEMBL_97289
Residue:700
BDBM50230129
NameBDBM50230129
Synonyms:CHEMBL407123
TypeSmall organic molecule
Emp. Form.C67H84N16O14
Mol. Mass.1337.4827
SMILESCC(C)C[C@H](NC(=O)[C@@H](Cc1ccc2ccccc2c1)NC(=O)[C@H](Cc1ccc(O)cc1)NC(=O)[C@H](CO)N(C)C(=O)[C@H](Cc1c[nH]c2ccccc12)NC(=O)[C@H](Cc1c[nH]cn1)NC(=O)[C@@H]1CCC(=O)N1)C(=O)N[C@@H](CCCN=C(N)N)C(=O)N1CCC[C@@H]1C(=O)NCC(O)=O