Reaction Details
TargetPotassium-transporting ATPase alpha chain 1/subunit beta
LigandBDBM50241342
Substrate/Competitorn/a
Meas. Tech.ChEMBL_76088 (CHEMBL858329)
IC50 1000±n/a nM
Citation Kohl, BSturm, ESenn-Bilfinger, JSimon, WAKrüger, USchaefer, HRainer, GFigala, VKlemm, K (H+,K+)-ATPase inhibiting 2-[(2-pyridylmethyl)sulfinyl]benzimidazoles. 4. A novel series of dimethoxypyridyl-substituted inhibitors with enhanced selectivity. The selection of pantoprazole as a clinical candidate. J Med Chem35:1049-57 (1992) Potassium-transporting ATPase alpha chain 1/subunit beta
Name:Potassium-transporting ATPase alpha chain 1/subunit beta
Type:n/a
Mol. Mass.:n/a
Description:ASSAY_ID of EBI is 71495
Components:This complex has 2 components.
Component 1
Name:Potassium-transporting ATPase alpha chain 1
Synonyms:ATP4A Gastric H(+)/K(+) ATPase subunit alpha Potassium-transporting ATPase alpha chain 1 | Proton pump
Type:PROTEIN
Mol. Mass.:114109.05
Organism:Homo sapiens (Human)
Description:EBI_82
Residue:1035
Component 2
Name:Potassium-transporting ATPase subunit beta
Synonyms:ATP4B Gastric H(+)/K(+) ATPase subunit beta Potassium-transporting ATPase subunit beta | Proton pump beta chain
Type:PROTEIN
Mol. Mass.:33369.83
Organism:Homo sapiens (Human)
Description:EBI_10719
Residue:291
BDBM50241342
NameBDBM50241342
Synonyms:5-(difluoromethoxy)-2-((3,4-dimethoxypyridin-2-yl)methylsulfinyl)-1H-benzo[d]imidazole 6-(difluoromethoxy)-2-((3,4-dimethoxypyridin-2-yl)methylsulfinyl)-1H-benzo[d]imidazole CHEMBL1502 Protonix SK-96022
TypeSmall organic molecule
Emp. Form.C16H15F2N3O4S
Mol. Mass.383.37
SMILESCOc1ccnc(CS(=O)c2nc3ccc(OC(F)F)cc3[nH]2)c1OC