Reaction Details
TargetGastrin/cholecystokinin type B receptor
LigandBDBM50230684
Substrate/Competitorn/a
Meas. Tech.ChEMBL_48424 (CHEMBL660352)
Ki 4.0±n/a nM
Citation Higginbottom, MKneen, CRatcliffe, GS Rationally designed"dipeptoid" analogues of CCK. A Free-Wilson/Fujita-Ban analysis of some alpha-methyltryptophan derivatives as CCK-B antagonists. J Med Chem35:1572-7 (1992) Gastrin/cholecystokinin type B receptor
Name:Gastrin/cholecystokinin type B receptor
Type:Enzyme Catalytic Domain
Mol. Mass.:49196.59
Organism:MOUSE
Description:Cholecystokinin A CCKBR MOUSE::P56481
Residue:453
BDBM50230684
NameBDBM50230684
Synonyms:CHEMBL353157 | PD-135118
TypeSmall organic molecule
Emp. Form.C36H44N4O6
Mol. Mass.628.7578
SMILESC[C@](Cc1c[nH]c2ccccc12)(NC(=O)OC1C2CC3CC(C2)CC1C3)C(=O)N[C@H](CNC(=O)CCC(O)=O)Cc1ccccc1