Reaction Details
TargetType-1 angiotensin II receptor A/Type-1 angiotensin II receptor B/Type-2 angiotensin II receptor
LigandBDBM50011975
Substrate/Competitorn/a
Meas. Tech.ChEMBL_34827 (CHEMBL648761)
IC50 1.5±n/a nM
Citation Keenan, RMWeinstock, JFinkelstein, JAFranz, RGGaitanopoulos, DEGirard, GRHill, DTMorgan, TMSamanen, JMPeishoff, CE Potent nonpeptide angiotensin II receptor antagonists. 2. 1-(Carboxybenzyl)imidazole-5-acrylic acids. J Med Chem36:1880-92 (1993) Type-1 angiotensin II receptor A/Type-1 angiotensin II receptor B/Type-2 angiotensin II receptor
Name:Type-1 angiotensin II receptor A/Type-1 angiotensin II receptor B/Type-2 angiotensin II receptor
Type:n/a
Mol. Mass.:n/a
Description:ASSAY_ID of ChEMBL is 36477
Components:This complex has 3 components.
Component 1
Name:Type-1 angiotensin II receptor B
Synonyms:AGTRB_RAT Agtr1 Angiotensin II AT1B Angiotensin II type 1b (AT-1b) receptor Type-1B angiotensin II receptor
Type:Enzyme Catalytic Domain
Mol. Mass.:40929.44
Organism:RAT
Description:Angiotensin II AT1B 0 RAT::P29089
Residue:359
Component 2
Name:Type-2 angiotensin II receptor
Synonyms:AGTR2_RAT Agtr2 Angiotensin II receptor Type-2 angiotensin II receptor
Type:Enzyme Catalytic Domain
Mol. Mass.:41346.62
Organism:RAT
Description:Angiotensin II AT2 0 0::P35351
Residue:363
Component 3
Name:Type-1 angiotensin II receptor A
Synonyms:AGTRA_RAT Agtr1 Angiotensin II AT1 Angiotensin II receptor (AT-1) type-1 Type-1A angiotensin II receptor
Type:Enzyme Catalytic Domain
Mol. Mass.:40910.53
Organism:RAT
Description:ANGIOTENSIN AT1 AGTR1 RAT::P25095
Residue:359
BDBM50011975
NameBDBM50011975
Synonyms:4-[2-Butyl-5-((E)-2-carboxy-3-thiophen-2-yl-propenyl)-imidazol-1-ylmethyl]-3-chloro-benzoic acid CHEMBL37679
TypeSmall organic molecule
Emp. Form.C23H23ClN2O4S
Mol. Mass.458.958
SMILESCCCCc1ncc(\C=C(/Cc2cccs2)C(O)=O)n1Cc1ccc(cc1Cl)C(O)=O