Reaction Details
TargetType-1 angiotensin II receptor A/B
LigandBDBM50231011
Substrate/Competitorn/a
Meas. Tech.ChEMBL_35110 (CHEMBL649312)
Ki 44±n/a nM
Citation Kim, KSQian, LBird, JEDickinson, KEMoreland, SSchaeffer, TRWaldron, TLDelaney, CLWeller, HNMiller, AV Quinoxaline N-oxide containing potent angiotensin II receptor antagonists: synthesis, biological properties, and structure-activity relationships. J Med Chem36:2335-42 (1993) 
 
Type-1 angiotensin II receptor A/B
Name:Type-1 angiotensin II receptor A/B
Type:n/a
Mol. Mass.:n/a
Description:ASSAY_ID of ChEMBL is 901964
Components:This complex has 2 components.
Component 1
Name:Type-1 angiotensin II receptor B
Synonyms:AGTRB_RAT Agtr1 Angiotensin II AT1B Angiotensin II type 1b (AT-1b) receptor Type-1B angiotensin II receptor
Type:Enzyme Catalytic Domain
Mol. Mass.:40929.44
Organism:RAT
Description:Angiotensin II AT1B 0 RAT::P29089
Residue:359
Component 2
Name:Type-1 angiotensin II receptor A
Synonyms:AGTRA_RAT Agtr1 Angiotensin II AT1 Angiotensin II receptor (AT-1) type-1 Type-1A angiotensin II receptor
Type:Enzyme Catalytic Domain
Mol. Mass.:40910.53
Organism:RAT
Description:ANGIOTENSIN AT1 AGTR1 RAT::P25095
Residue:359
BDBM50231011
NameBDBM50231011
Synonyms:CHEMBL309489
TypeSmall organic molecule
Emp. Form.C28H26N6O4
Mol. Mass.510.5438
SMILESCCCCc1nc2ccc(OCC)c(C(O)=O)c2nc1Oc1ccc(cc1)-c1ccccc1-c1nn[nH]n1