Reaction Details
TargetMelatonin receptor type 1A/1B/1C
LigandBDBM50035176
Substrate/Competitorn/a
Meas. Tech.ChEMBL_104761 (CHEMBL710993)
Ki 46±n/a nM
Citation Copinga, STepper, PGGrol, CJHorn, ASDubocovich, ML 2-Amido-8-methoxytetralins: a series of nonindolic melatonin-like agents. J Med Chem36:2891-8 (1993) 
 
Melatonin receptor type 1A/1B/1C
Name:Melatonin receptor type 1A/1B/1C
Synonyms:Melatonin receptor
Type:n/a
Mol. Mass.:n/a
Description:ASSAY_ID of ChEMBL is 104753
Components:This complex has 3 components.
Component 1
Name:Melatonin receptor type 1A
Type:PROTEIN
Mol. Mass.:39911.03
Organism:Gallus gallus
Description:ChEMBL_104739
Residue:353
Component 2
Name:Melatonin receptor type 1B
Synonyms:MEL-1B-R Melatonin Melatonin receptor type 1B
Type:Enzyme Catalytic Domain
Mol. Mass.:33012.73
Organism:Chick
Description:Melatonin 0 Chick::P51050
Residue:289
Component 3
Name:Melatonin receptor type 1C
Synonyms:CKB Mel-1C-R Melatonin receptor type 1C
Type:PROTEIN
Mol. Mass.:38595.98
Organism:Gallus gallus
Description:ChEMBL_104739
Residue:346
BDBM50035176
NameBDBM50035176
Synonyms:8-M-ADOT N-(8-Methoxy-1,2,3,4-tetrahydro-naphthalen-2-yl)-acetamide
TypeSmall organic molecule
Emp. Form.C13H17NO2
Mol. Mass.219.2796
SMILESCOc1cccc2CCC(Cc12)NC(C)=O