Reaction Details
TargetMelatonin receptor type 1A/1B/1C
LigandBDBM50231291
Substrate/Competitorn/a
Meas. Tech.ChEMBL_104761 (CHEMBL710993)
Ki 0.230000±n/a nM
Citation Copinga, STepper, PGGrol, CJHorn, ASDubocovich, ML 2-Amido-8-methoxytetralins: a series of nonindolic melatonin-like agents. J Med Chem36:2891-8 (1993) 
 
Melatonin receptor type 1A/1B/1C
Name:Melatonin receptor type 1A/1B/1C
Synonyms:Melatonin receptor
Type:n/a
Mol. Mass.:n/a
Description:ASSAY_ID of ChEMBL is 104753
Components:This complex has 3 components.
Component 1
Name:Melatonin receptor type 1A
Type:PROTEIN
Mol. Mass.:39911.03
Organism:Gallus gallus
Description:ChEMBL_104739
Residue:353
Component 2
Name:Melatonin receptor type 1B
Synonyms:MEL-1B-R Melatonin Melatonin receptor type 1B
Type:Enzyme Catalytic Domain
Mol. Mass.:33012.73
Organism:Chick
Description:Melatonin 0 Chick::P51050
Residue:289
Component 3
Name:Melatonin receptor type 1C
Synonyms:CKB Mel-1C-R Melatonin receptor type 1C
Type:PROTEIN
Mol. Mass.:38595.98
Organism:Gallus gallus
Description:ChEMBL_104739
Residue:346
BDBM50231291
NameBDBM50231291
Synonyms:CHEMBL421013
TypeSmall organic molecule
Emp. Form.C14H16Cl2N2O2
Mol. Mass.315.195
SMILESCOc1cc2c(CCNC(C)=O)c(C)[nH]c2c(Cl)c1Cl