Reaction Details
TargetCannabinoid receptor 1/2
LigandBDBM22988
Substrate/Competitorn/a
Meas. Tech.ChEMBL_46139 (CHEMBL876970)
Ki 52±n/a nM
Citation Hanus, LGopher, AAlmog, SMechoulam, R Two new unsaturated fatty acid ethanolamides in brain that bind to the cannabinoid receptor. J Med Chem36:3032-4 (1993) 
 
Cannabinoid receptor 1/2
Name:Cannabinoid receptor 1/2
Synonyms:Cannabinoid receptor
Type:n/a
Mol. Mass.:n/a
Description:ASSAY_ID of ChEMBL is 46139
Components:This complex has 2 components.
Component 1
Name:Cannabinoid receptor 2
Type:Enzyme Catalytic Domain
Mol. Mass.:38220.43
Organism:MOUSE
Description:P47936
Residue:347
Component 2
Name:Cannabinoid receptor 1
Synonyms:Brain-type cannabinoid receptor CB-R CNR1_MOUSE Cannabinoid receptor | Cnr1
Type:Enzyme
Mol. Mass.:52842.52
Organism:Mus musculus (Mouse)
Description:P47746
Residue:473
BDBM22988
NameBDBM22988
Synonyms:(5Z,8Z,11Z,14Z)-N-(2-hydroxyethyl)icosa-5,8,11,14-tetraenamide ANANDAMIDE Arachidonoyl ethanolamide (AEA) Arachidonylethanolamide [14C]Anandamide | [3H]Anandamide
Typeradiolabeled substrate
Emp. Form.C22H37NO2
Mol. Mass.347.5347
SMILESCCCCC\C=C/C\C=C/C\C=C/C\C=C/CCCC(=O)NCCO