Reaction Details
TargetLeukotriene B4 receptor 1/2
LigandBDBM50036750
Substrate/Competitorn/a
Meas. Tech.ChEMBL_88179 (CHEMBL700859)
IC50 8.4±n/a nM
Citation Sofia, MJFloreancig, PBach, NJBaker, SRCockerham, SLFleisch, JHFroelich, LLJackson, WTMarder, PRoman, CR o-phenylphenols: potent and orally active leukotriene B4 receptor antagonists. J Med Chem36:3978-81 (1993) 
 
Leukotriene B4 receptor 1/2
Name:Leukotriene B4 receptor 1/2
Synonyms:Leukotriene B4 receptor
Type:n/a
Mol. Mass.:n/a
Description:ASSAY_ID of ChEMBL is 88360
Components:This complex has 2 components.
Component 1
Name:Leukotriene B4 receptor 2
Type:Enzyme Catalytic Domain
Mol. Mass.:37964.86
Organism:Homo sapiens (Human)
Description:Leukotriene 2 0 HUMAN::Q9NPC1
Residue:358
Component 2
Name:Leukotriene B4 receptor 1
Synonyms:BLT BLTR Chemoattractant receptor-like 1 GPR16 LTB4-R 1 Leukotriene B4 R1 Leukotriene B4 receptor 1 P2Y purinoceptor 7 | P2Y7
Type:Enzyme Catalytic Domain
Mol. Mass.:37582.68
Organism:Homo sapiens (Human)
Description:Q15722
Residue:352
BDBM50036750
NameBDBM50036750
Synonyms:2-ethoxy-4-ethyl-5-[6-methyl-6-(2H-1,2,3,4-tetraazol-5-yl)heptyloxy]phenol; with sodium ion Sodium salt of 2-Ethoxy-4-ethyl-5-[6-methyl-6-(2H-tetrazol-5-yl)-heptyloxy]-phenol | sodium 2-ethoxy-4-ethyl-5-[6-methyl-6-(2H-1,2,3,4-tetraazol-5-yl)heptyloxy]phenol
TypeSmall organic molecule
Emp. Form.C19H29N4O3
Mol. Mass.361.4591
SMILESCCOc1cc(CC)c(OCCCCCC(C)(C)c2nn[n-]n2)cc1O